1.13.x Master build errors

Discuss the technical details of Gargoyle and ongoing development

Moderator: Moderators

ispyisail
Moderator
Posts: 4834
Joined: Mon Apr 06, 2009 3:15 am
Location: New Zealand

1.13.x Master build errors

Post by ispyisail »

I suspect x86 problems?

Code: Select all

ake supports nested variables... yes
checking whether to enable maintainer-specific portions of Makefiles... no
checking whether make supports nested variables... (cached) yes
checking build system type... x86_64-pc-linux-gnu
checking host system type... x86_64-openwrt-linux-gnu
configure: autobuild project... libgpg-error
configure: autobuild revision... 1.36-unknown
configure: autobuild hostname... ubuntu20
configure: autobuild timestamp... 20200520-225721
checking for x86_64-openwrt-linux-gcc... x86_64-openwrt-linux-musl-gcc
checking whether the C compiler works... yes
checking for C compiler default output file name... a.out
checking for suffix of executables...
checking whether we are cross compiling... yes
checking for suffix of object files... o
checking whether we are using the GNU C compiler... yes
checking whether x86_64-openwrt-linux-musl-gcc accepts -g... yes
checking for x86_64-openwrt-linux-musl-gcc option to accept ISO C89... none need                            ed
checking whether x86_64-openwrt-linux-musl-gcc understands -c and -o together...                             yes
checking for style of include used by make... GNU
checking dependency style of x86_64-openwrt-linux-musl-gcc... gcc3
checking how to run the C preprocessor... x86_64-openwrt-linux-musl-gcc -E
checking for gawk... (cached) gawk
checking for x86_64-openwrt-linux-ar... x86_64-openwrt-linux-musl-gcc-ar
checking for grep that handles long lines and -e... /home/user/gargoyle/x86-src/                            staging_dir/host/bin/grep
checking for egrep... /home/user/gargoyle/x86-src/staging_dir/host/bin/grep -E
checking for ANSI C header files... yes
checking for sys/types.h... yes
checking for sys/stat.h... yes
checking for stdlib.h... yes
checking for string.h... yes
checking for memory.h... yes
checking for strings.h... yes
checking for inttypes.h... yes
checking for stdint.h... yes
checking for unistd.h... yes
checking minix/config.h usability... no
checking minix/config.h presence... no
checking for minix/config.h... no
checking whether it is safe to define __EXTENSIONS__... yes
checking for special C compiler options needed for large files... no
checking for _FILE_OFFSET_BITS value needed for large files... no
checking how to print strings... printf
checking for a sed that does not truncate output... /home/user/gargoyle/x86-src/                            staging_dir/host/bin/sed
checking for fgrep... /home/user/gargoyle/x86-src/staging_dir/host/bin/grep -F
checking for ld used by x86_64-openwrt-linux-musl-gcc... x86_64-openwrt-linux-mu                            sl-ld
checking if the linker (x86_64-openwrt-linux-musl-ld) is GNU ld... yes
checking for BSD- or MS-compatible name lister (nm)... x86_64-openwrt-linux-musl                            -gcc-nm
checking the name lister (x86_64-openwrt-linux-musl-gcc-nm) interface... BSD nm
checking whether ln -s works... yes
checking the maximum length of command line arguments... 1572864
checking whether the shell understands some XSI constructs... yes
checking whether the shell understands "+="... yes
checking how to convert x86_64-pc-linux-gnu file names to x86_64-pc-linux-gnu fo                            rmat... func_convert_file_noop
checking how to convert x86_64-pc-linux-gnu file names to toolchain format... fu                            nc_convert_file_noop
checking for x86_64-openwrt-linux-musl-ld option to reload object files... -r
checking for x86_64-openwrt-linux-objdump... x86_64-openwrt-linux-musl-objdump
checking how to recognize dependent libraries... pass_all
checking for x86_64-openwrt-linux-dlltool... no
checking for dlltool... no
checking how to associate runtime and link libraries... printf %s\n
checking for x86_64-openwrt-linux-ar... (cached) x86_64-openwrt-linux-musl-gcc-a                            r
checking for archiver @FILE support... @
checking for x86_64-openwrt-linux-strip... (cached) x86_64-openwrt-linux-musl-st                            rip
checking for x86_64-openwrt-linux-ranlib... x86_64-openwrt-linux-musl-gcc-ranlib
checking command to parse x86_64-openwrt-linux-musl-gcc-nm output from x86_64-op                            enwrt-linux-musl-gcc object... ok
checking for sysroot... no
checking for x86_64-openwrt-linux-mt... no
checking for mt... mt
configure: WARNING: using cross tools not prefixed with host triplet
checking if mt is a manifest tool... no
checking for dlfcn.h... yes
checking for objdir... .libs
checking if x86_64-openwrt-linux-musl-gcc supports -fno-rtti -fno-exceptions...                             no
checking for x86_64-openwrt-linux-musl-gcc option to produce PIC... -fPIC -DPIC
checking if x86_64-openwrt-linux-musl-gcc PIC flag -fPIC -DPIC works... yes
checking if x86_64-openwrt-linux-musl-gcc static flag -static works... yes
checking if x86_64-openwrt-linux-musl-gcc supports -c -o file.o... yes
checking if x86_64-openwrt-linux-musl-gcc supports -c -o file.o... (cached) yes
checking whether the x86_64-openwrt-linux-musl-gcc linker (x86_64-openwrt-linux-                            musl-ld -m elf_x86_64) supports shared libraries... yes
checking whether -lc should be explicitly linked in... no
checking dynamic linker characteristics... GNU/Linux ld.so
checking how to hardcode library paths into programs... immediate
checking whether stripping libraries is possible... yes
checking if libtool supports shared libraries... yes
checking whether to build shared libraries... yes
checking whether to build static libraries... yes
checking for x86_64-openwrt-linux-windres... no
checking for windres... no
checking for build system executable suffix... no
checking whether NLS is requested... no
checking for msgfmt... /usr/bin/msgfmt
checking for gmsgfmt... /usr/bin/msgfmt
checking for xgettext... /usr/bin/xgettext
checking for msgmerge... /usr/bin/msgmerge
checking for ld used by x86_64-openwrt-linux-musl-gcc... x86_64-openwrt-linux-mu                            sl-ld -m elf_x86_64
checking if the linker (x86_64-openwrt-linux-musl-ld -m elf_x86_64) is GNU ld...                             yes
checking for shared library run path origin... done
checking for CFPreferencesCopyAppValue... no
checking for CFLocaleCopyCurrent... no
checking whether to use NLS... no
checking for ANSI C header files... (cached) yes
checking for stdlib.h... (cached) yes
checking locale.h usability... yes
checking locale.h presence... yes
checking for locale.h... yes
checking for stdint.h... (cached) yes
checking sys/select.h usability... yes
checking sys/select.h presence... yes
checking for sys/select.h... yes
checking sys/time.h usability... yes
checking sys/time.h presence... yes
checking for sys/time.h... yes
checking signal.h usability... yes
checking signal.h presence... yes
checking for signal.h... yes
checking whether strerror_r is declared... yes
checking for strerror_r... yes
checking whether strerror_r returns char *... no
checking for strerror_r... (cached) yes
checking for pid_t... yes
checking vfork.h usability... no
checking vfork.h presence... no
checking for vfork.h... no
checking for fork... yes
checking for vfork... yes
checking for working fork... cross
configure: WARNING: result yes guessed because of cross compilation
checking for working vfork... (cached) yes
checking for flockfile... yes
checking for vasprintf... yes
checking for mmap... yes
checking for rand... yes
checking for strlwr... no
checking for stpcpy... yes
checking for setenv... yes
checking for stat... yes
checking for getrlimit... yes
checking for an ANSI C-conforming const... yes
checking size of int... (cached) 4
checking size of long... (cached) 8
checking size of long long... (cached) 8
checking whether time.h and sys/time.h may both be included... yes
checking size of time_t... 8
checking for sys/stat.h... (cached) yes
checking for unistd.h... (cached) yes
checking direct.h usability... no
checking direct.h presence... no
checking for direct.h... no
checking if mkdir takes one argument... no
configure: checking for cc features
checking if gcc ignores unknown -Wno-* options... yes
checking if gcc supports -Wpointer-arith... yes
checking whether the GCC style aligned attribute is supported... yes
checking whether the visibility attribute is supported... yes
checking for broken visibility attribute... no
checking for broken alias attribute... no
checking if gcc supports -fvisibility=hidden... yes
checking whether imported symbols can be declared weak... guessing yes
checking pthread.h usability... yes
checking pthread.h presence... yes
checking for pthread.h... yes
checking for pthread_kill in -lpthread... yes
checking for multithread API to use... posix
checking for pthread_rwlock_t... yes
checking size of pthread_mutex_t... 40
checking for library containing sched_yield... none required
checking for library containing inet_addr... none required
checking for library containing socket... none required
checking whether readline via "-lreadline" is present and sane... yes
checking for unsigned long long int... yes
configure: checking system features for estream-printf
checking for stdint.h... (cached) yes
checking for long long int... yes
checking for long double... yes
checking for intmax_t... yes
checking for uintmax_t... yes
checking for ptrdiff_t... yes
checking size of unsigned long... (cached) 8
checking size of void *... (cached) 8
checking for nl_langinfo and THOUSEP... yes
configure: checking system features for estream
checking for memrchr... yes
checking whether to enable log_clock... no
checking that generated files are newer than configure... done
configure: creating ./config.status
config.status: creating Makefile
config.status: creating doc/Makefile
config.status: creating po/Makefile.in
config.status: creating m4/Makefile
config.status: creating src/Makefile
config.status: creating tests/Makefile
config.status: creating lang/Makefile
config.status: creating lang/cl/Makefile
config.status: creating lang/cl/gpg-error.asd
config.status: creating src/versioninfo.rc
config.status: creating src/gpg-error.w32-manifest
config.status: creating src/gpg-error.pc
config.status: creating src/gpg-error-config-old
config.status: creating config.h
config.status: executing depfiles commands
config.status: executing libtool commands
config.status: executing po-directories commands
config.status: creating po/POTFILES
config.status: creating po/Makefile

        libgpg-error v1.36-unknown has been configured as follows:

        Revision: 0000000  (0)
        Platform: x86_64-pc-linux-gnu

touch /home/user/gargoyle/x86-src/build_dir/target-x86_64_musl/libgpg-error-1.36                            /.configured_68b329da9893e34099c7d8ad5cb9c940
rm -f /home/user/gargoyle/x86-src/build_dir/target-x86_64_musl/libgpg-error-1.36                            /.built
touch /home/user/gargoyle/x86-src/build_dir/target-x86_64_musl/libgpg-error-1.36                            /.built_check
CFLAGS="-Os -pipe -fno-caller-saves -fno-plt -fhonour-copts -Wno-error=unused-bu                            t-set-variable -Wno-error=unused-result -iremap/home/user/gargoyle/x86-src/build                            _dir/target-x86_64_musl/libgpg-error-1.36:libgpg-error-1.36 -Wformat -Werror=for                            mat-security -fstack-protector -D_FORTIFY_SOURCE=1 -Wl,-z,now -Wl,-z,relro  -I/h                            ome/user/gargoyle/x86-src/staging_dir/target-x86_64_musl/usr/include -I/home/use                            r/gargoyle/x86-src/staging_dir/target-x86_64_musl/include -I/home/user/gargoyle/                            x86-src/staging_dir/toolchain-x86_64_gcc-7.5.0_musl/usr/include -I/home/user/gar                            goyle/x86-src/staging_dir/toolchain-x86_64_gcc-7.5.0_musl/include/fortify -I/hom                            e/user/gargoyle/x86-src/staging_dir/toolchain-x86_64_gcc-7.5.0_musl/include " CX                            XFLAGS="-Os -pipe -fno-caller-saves -fno-plt -fhonour-copts -Wno-error=unused-bu                            t-set-variable -Wno-error=unused-result -iremap/home/user/gargoyle/x86-src/build                            _dir/target-x86_64_musl/libgpg-error-1.36:libgpg-error-1.36 -Wformat -Werror=for                            mat-security -fstack-protector -D_FORTIFY_SOURCE=1 -Wl,-z,now -Wl,-z,relro  -I/h                            ome/user/gargoyle/x86-src/staging_dir/target-x86_64_musl/usr/include -I/home/use                            r/gargoyle/x86-src/staging_dir/target-x86_64_musl/include -I/home/user/gargoyle/                            x86-src/staging_dir/toolchain-x86_64_gcc-7.5.0_musl/usr/include -I/home/user/gar                            goyle/x86-src/staging_dir/toolchain-x86_64_gcc-7.5.0_musl/include/fortify -I/hom                            e/user/gargoyle/x86-src/staging_dir/toolchain-x86_64_gcc-7.5.0_musl/include " LD                            FLAGS="-L/home/user/gargoyle/x86-src/staging_dir/target-x86_64_musl/usr/lib -L/h                            ome/user/gargoyle/x86-src/staging_dir/target-x86_64_musl/lib -L/home/user/gargoy                            le/x86-src/staging_dir/toolchain-x86_64_gcc-7.5.0_musl/usr/lib -L/home/user/garg                            oyle/x86-src/staging_dir/toolchain-x86_64_gcc-7.5.0_musl/lib -znow -zrelro " mak                            e  -C /home/user/gargoyle/x86-src/build_dir/target-x86_64_musl/libgpg-error-1.36                            /. AR="x86_64-openwrt-linux-musl-gcc-ar" AS="x86_64-openwrt-linux-musl-gcc -c -O                            s -pipe -fno-caller-saves -fno-plt -fhonour-copts -Wno-error=unused-but-set-vari                            able -Wno-error=unused-result -iremap/home/user/gargoyle/x86-src/build_dir/targe                            t-x86_64_musl/libgpg-error-1.36:libgpg-error-1.36 -Wformat -Werror=format-securi                            ty -fstack-protector -D_FORTIFY_SOURCE=1 -Wl,-z,now -Wl,-z,relro" LD=x86_64-open                            wrt-linux-musl-ld NM="x86_64-openwrt-linux-musl-gcc-nm" CC="x86_64-openwrt-linux                            -musl-gcc" GCC="x86_64-openwrt-linux-musl-gcc" CXX="x86_64-openwrt-linux-musl-g+                            +" RANLIB="x86_64-openwrt-linux-musl-gcc-ranlib" STRIP=x86_64-openwrt-linux-musl                            -strip OBJCOPY=x86_64-openwrt-linux-musl-objcopy OBJDUMP=x86_64-openwrt-linux-mu                            sl-objdump SIZE=x86_64-openwrt-linux-musl-size CROSS="x86_64-openwrt-linux-musl-                            " ARCH="x86_64" ;
make[5]: Entering directory '/home/user/gargoyle/x86-src/build_dir/target-x86_64                            _musl/libgpg-error-1.36'
make  all-recursive
make[6]: Entering directory '/home/user/gargoyle/x86-src/build_dir/target-x86_64                            _musl/libgpg-error-1.36'
Making all in m4
make[7]: Entering directory '/home/user/gargoyle/x86-src/build_dir/target-x86_64                            _musl/libgpg-error-1.36/m4'
make[7]: Nothing to be done for 'all'.
make[7]: Leaving directory '/home/user/gargoyle/x86-src/build_dir/target-x86_64_                            musl/libgpg-error-1.36/m4'
Making all in src
make[7]: Entering directory '/home/user/gargoyle/x86-src/build_dir/target-x86_64                            _musl/libgpg-error-1.36/src'
gawk -f ./mkstrtable.awk -v textidx=3 \
        ./err-sources.h.in >err-sources.h
gawk: ./mkstrtable.awk:113: warning: regexp escape sequence `\#' is not a known                             regexp operator
gawk -f ./mkstrtable.awk -v textidx=3 \
        ./err-codes.h.in >err-codes.h
gawk: ./mkstrtable.awk:113: warning: regexp escape sequence `\#' is not a known                             regexp operator
gawk -f ./mkerrnos.awk ./errnos.in >code-to-errno.h
gawk: ./mkerrnos.awk:86: warning: regexp escape sequence `\#' is not a known reg                            exp operator
gawk -f ./mkerrcodes1.awk ./errnos.in >_mkerrcodes.h
gawk: ./mkerrcodes1.awk:84: warning: regexp escape sequence `\#' is not a known                             regexp operator
x86_64-openwrt-linux-musl-gcc -E -I/home/user/gargoyle/x86-src/staging_dir/targe                            t-x86_64_musl/usr/include -I/home/user/gargoyle/x86-src/staging_dir/target-x86_6                            4_musl/include -I/home/user/gargoyle/x86-src/staging_dir/toolchain-x86_64_gcc-7.                            5.0_musl/usr/include -I/home/user/gargoyle/x86-src/staging_dir/toolchain-x86_64_                            gcc-7.5.0_musl/include/fortify -I/home/user/gargoyle/x86-src/staging_dir/toolcha                            in-x86_64_gcc-7.5.0_musl/include   -P _mkerrcodes.h | grep GPG_ERR_ | \
               gawk -f ./mkerrcodes.awk >mkerrcodes.h
gawk: ./mkerrcodes.awk:88: warning: regexp escape sequence `\#' is not a known r                            egexp operator
rm _mkerrcodes.h
gcc -I. -I. -o mkerrcodes ./mkerrcodes.c
./mkerrcodes | gawk -f ./mkerrcodes2.awk >code-from-errno.h
gawk: ./mkerrcodes2.awk:94: warning: regexp escape sequence `\#' is not a known                             regexp operator
gawk -f ./mkstrtable.awk -v textidx=2 -v nogettext=1 \
        ./err-sources.h.in >err-sources-sym.h
gawk: ./mkstrtable.awk:113: warning: regexp escape sequence `\#' is not a known                             regexp operator
gawk -f ./mkstrtable.awk -v textidx=2 -v nogettext=1 \
        ./err-codes.h.in >err-codes-sym.h
gawk: ./mkstrtable.awk:113: warning: regexp escape sequence `\#' is not a known                             regexp operator
gawk -f ./mkstrtable.awk -v textidx=2 -v nogettext=1 \
        -v prefix=GPG_ERR_ -v namespace=errnos_ \
        ./errnos.in >errnos-sym.h
gawk: fatal: cannot use gawk builtin `namespace' as variable name
make[7]: *** [Makefile:1616: errnos-sym.h] Error 2
make[7]: Leaving directory '/home/user/gargoyle/x86-src/build_dir/target-x86_64_                            musl/libgpg-error-1.36/src'
make[6]: *** [Makefile:508: all-recursive] Error 1
make[6]: Leaving directory '/home/user/gargoyle/x86-src/build_dir/target-x86_64_                            musl/libgpg-error-1.36'
make[5]: *** [Makefile:440: all] Error 2
make[5]: Leaving directory '/home/user/gargoyle/x86-src/build_dir/target-x86_64_                            musl/libgpg-error-1.36'
make[4]: *** [Makefile:90: /home/user/gargoyle/x86-src/build_dir/target-x86_64_m                            usl/libgpg-error-1.36/.built] Error 2
make[4]: Leaving directory '/home/user/gargoyle/x86-src/package/libgpg-error'
time: package/libgpg-error/compile#7.38#0.90#9.43
make[3]: *** [package/Makefile:113: package/libgpg-error/compile] Error 2
make[3]: Leaving directory '/home/user/gargoyle/x86-src'
make[2]: *** [package/Makefile:107: /home/user/gargoyle/x86-src/staging_dir/targ                            et-x86_64_musl/stamp/.package_compile] Error 2
make[2]: Leaving directory '/home/user/gargoyle/x86-src'
make[1]: *** [/home/user/gargoyle/x86-src/include/toplevel.mk:227: world] Error                             2
make[1]: Leaving directory '/home/user/gargoyle/x86-src'
user@ubuntu20:~/gargoyle$

Lantis
Moderator
Posts: 5590
Joined: Mon Jan 05, 2015 5:33 am
Location: Australia

Re: 1.13.x Master build errors

Post by Lantis »

Have you updated your build environment?
Either way, I can fix this but I need a bit of time to test. I can post the patch if you want to test in parallel.
http://lantisproject.com/downloads/gargoyle_ispyisail.php for the latest releases
Please be respectful when posting. I do this in my free time on a volunteer basis.

ispyisail
Moderator
Posts: 4834
Joined: Mon Apr 06, 2009 3:15 am
Location: New Zealand

Re: 1.13.x Master build errors

Post by ispyisail »

Have you updated your build environment?
New Machine, first time build.

Has the build environment changed?


Just reporting...................

Lantis
Moderator
Posts: 5590
Joined: Mon Jan 05, 2015 5:33 am
Location: Australia

Re: 1.13.x Master build errors

Post by Lantis »

You must have gawk 5 which requires a patch to enable the build.
If it's a new machine, you're probably running a pretty recent OS. It makes sense.

Just need to make sure the patch fixes the issue but doesn't break the build.
http://lantisproject.com/downloads/gargoyle_ispyisail.php for the latest releases
Please be respectful when posting. I do this in my free time on a volunteer basis.

Lantis
Moderator
Posts: 5590
Joined: Mon Jan 05, 2015 5:33 am
Location: Australia

Re: 1.13.x Master build errors

Post by Lantis »

I'm testing it now, but this should be sufficient.
https://pastebin.com/yrukVwaD
http://lantisproject.com/downloads/gargoyle_ispyisail.php for the latest releases
Please be respectful when posting. I do this in my free time on a volunteer basis.

ispyisail
Moderator
Posts: 4834
Joined: Mon Apr 06, 2009 3:15 am
Location: New Zealand

Re: 1.13.x Master build errors

Post by ispyisail »

Sorry, I'm not as skilled as I would like

Is there an easy way to apply your patch?

Can you apply it to master then I can just git pull?

Lantis
Moderator
Posts: 5590
Joined: Mon Jan 05, 2015 5:33 am
Location: Australia

Re: 1.13.x Master build errors

Post by Lantis »

http://lantisproject.com/downloads/gargoyle_ispyisail.php for the latest releases
Please be respectful when posting. I do this in my free time on a volunteer basis.

ispyisail
Moderator
Posts: 4834
Joined: Mon Apr 06, 2009 3:15 am
Location: New Zealand

Re: 1.13.x Master build errors

Post by ispyisail »

Building

CompMan
Posts: 2
Joined: Tue May 26, 2020 12:03 pm

Re: 1.13.x Master build errors

Post by CompMan »

Hello! I tried to compile firmware 1.13 on Windows 10 with the Windows subsystem for Linux. Linux version - Ubuntu 20.04 LTS. At the end of the compilation, I got an error. Tell me, please, what could be the problem?

Code: Select all

*
* Options common to all shells
*
POSIX math support (FEATURE_SH_MATH) [Y/n/?] y
  Extend POSIX math support to 64 bit (FEATURE_SH_MATH_64) [Y/n/?] y
Hide message on interactive shell startup (FEATURE_SH_EXTRA_QUIET) [N/y/?] n
Standalone shell (FEATURE_SH_STANDALONE) [N/y/?] n
Run 'nofork' applets directly (FEATURE_SH_NOFORK) [Y/n/?] y
read -t N.NNN support (+110 bytes) (FEATURE_SH_READ_FRAC) [N/y/?] n
Use $HISTFILESIZE (FEATURE_SH_HISTFILESIZE) [N/y/?] n
Embed scripts in the binary (FEATURE_SH_EMBEDDED_SCRIPTS) [N/y/?] n
*
* System Logging Utilities
*
klogd (5.7 kb) (KLOGD) [N/y/?] n
logger (6.3 kb) (LOGGER) [Y/n/?] y
logread (4.8 kb) (LOGREAD) [N/y/?] n
syslogd (13 kb) (SYSLOGD) [N/y/?] n
sleep: cannot read realtime clock: Invalid argument
make[6]: *** [/home/sanchez/gargoyle/ramips-src/build_dir/target-mipsel_24kc_musl/busybox-1.30.1/scripts/kconfig/Makefile:37: oldconfig] Error 1
make[5]: *** [Makefile:444: oldconfig] Error 2
make[5]: Leaving directory '/home/sanchez/gargoyle/ramips-src/build_dir/target-mipsel_24kc_musl/busybox-1.30.1'
make[4]: *** [Makefile:125: /home/sanchez/gargoyle/ramips-src/build_dir/target-mipsel_24kc_musl/busybox-1.30.1/.configured_68b329da9893e34099c7d8ad5cb9c940_77176fd844ec4513c96140a9ff009b23] Error 2
make[4]: Leaving directory '/home/sanchez/gargoyle/ramips-src/package/utils/busybox'
time: package/utils/busybox/compile#1.98#3.17#8.13
make[3]: *** [package/Makefile:113: package/utils/busybox/compile] Error 2
make[3]: Leaving directory '/home/sanchez/gargoyle/ramips-src'
make[2]: *** [package/Makefile:107: /home/sanchez/gargoyle/ramips-src/staging_dir/target-mipsel_24kc_musl/stamp/.package_compile] Error 2
make[2]: Leaving directory '/home/sanchez/gargoyle/ramips-src'
make[1]: *** [/home/sanchez/gargoyle/ramips-src/include/********.**:227: world] Error 2
make[1]: Leaving directory '/home/sanchez/gargoyle/ramips-src'

Lantis
Moderator
Posts: 5590
Joined: Mon Jan 05, 2015 5:33 am
Location: Australia

Re: 1.13.x Master build errors

Post by Lantis »

https://github.com/microsoft/WSL/issues ... -628765763
Fault with WSL.

Read the whole thread if you like. Suggestions appear to be:
- a few dodgy workarounds
- downgrade libc to 2.30
- wait for the patch to WSL (2 weeks estimated)
- try WSL2 if it's available to you
- use Ubuntu 18.04 not 20.04

Unfortunately not something we can assist you with.
http://lantisproject.com/downloads/gargoyle_ispyisail.php for the latest releases
Please be respectful when posting. I do this in my free time on a volunteer basis.

Post Reply